calice orthodoxe
created: 2012-05-16T00:00:00+02:00
modified: 2014-01-10T00:00:00+01:00
status: 1
type: Concept
broader: T69-2103
definition: Récipient destiné à la communion, proche du calice du culte catholique. La communion pour les fidèles orthodoxes est toujours sous les deux espèces.
in scheme: T69