chandelier à sept branches orthodoxe
created: 2012-05-16T00:00:00+02:00
modified: 2014-01-10T00:00:00+01:00
status: 1
type: Concept
broader: T69-2103
definition: Chandelier de grandes dimensions posé derrière l'autel et comportant sept lumières : ce chandelier tient lieu, en général, de chandelier d'autel.
in scheme: T69
scope note: Il est plus particulièrement employé dans l'église grecque en référence au temple de Jérusalem.