chandelier d'autel orthodoxe
created: 2012-05-16T00:00:00+02:00
modified: 2014-01-10T00:00:00+01:00
status: 1
type: Concept
broader: T69-2103
in scheme: T69
scope note: Chandelier utilisé en nombre variable, posé par terre ou placé sur l'autel dans le cas où il n'y a pas de chandelier à sept branches.