coffret aux saintes huiles orthodoxe
created: 2012-05-16T00:00:00+02:00
modified: 2014-01-10T00:00:00+01:00
status: 1
type: Concept
alternative label: boîte aux saintes huiles orthodoxe
alternative label: boîte à baptême
broader: T69-2103
definition: Coffret contenant deux ampoules, l'une pour l'huile de baptême dite huile d'allégresse, qui sert à l'onction des nouveaux-nés, ou pour l'huile du pénitent, qui sert à l'extrême-onction et l'autre pour le saint Chrême.
in scheme: T69
scope note: La boîte à baptême contient, outre les saintes huiles, des ciseaux et un pinceau pour le sacrement du baptême.