colombe eucharistique orthodoxe
created: 2012-05-16T00:00:00+02:00
modified: 2014-01-10T00:00:00+01:00
status: 1
type: Concept
broader: T69-2103
definition: Vase sacré en forme de colombe, dans lequel étaient conservées les saintes espèces (ou les saint dons) . La colombe est suspendue par des chaînes au-dessus de l'autel ; elle est parfois sous un dais.
in scheme: T69