couronne de mariage orthodoxe
terme associe: T69-7960
created: 2012-05-16T00:00:00+02:00
modified: 2014-01-06T00:00:00+01:00
status: 1
type: Concept
broader: T69-2103
definition: Paire de couronnes placées au-dessus des mariés pendant la cérémonie du mariage. Elles portent des icônes du Christ pour la couronne du marié et de la Vierge pour celle de la mariée.
in scheme: T69
related: T69-7960