croix d'autel orthodoxe
created: 2012-05-16T00:00:00+02:00
modified: 2014-01-10T00:00:00+01:00
status: 1
type: Concept
broader: T69-2103
definition: Croix destinée à être posée à plat sur l'autel et servant lors des bénédictions. De formes variées, mais comportant, si elle n'en a pas la forme, une représentation de la croix orthodoxe constituée d'un montant vertical et de trois traverses ; les deux traverses supérieures sont parallèles, horizontales et de longueurs inégales, la plus grande étant au centre ; la traverse inférieure est oblique, la branche la plus basse située à la gauche du Christ.
in scheme: T69