encensoir orthodoxe
terme associe: T69-1374
created: 2012-05-16T00:00:00+02:00
modified: 2014-01-10T00:00:00+01:00
status: 1
type: Concept
alternative label: chazion
alternative label: encensoir à main
broader: T69-2103
definition: Encensoir de même structure et usage que les encensoirs du culte catholique, mais avec des chaînes plus courtes. Dans le rite grec, les encensoirs comportent soit douze grelots accrochés trois par trois aux quatre chaînes, symboles des douze apôtres, soit une anse latérale.
in scheme: T69
related: T69-1374