flacon à aspersion
created: 2012-05-16T00:00:00+02:00
modified: 2014-01-10T00:00:00+01:00
status: 1
type: Concept
broader: T69-2103
definition: Petit flacon à goulot axial, à bouchon repercé ou en forme de tête de colombe, dans lequel on met de l'eau de rose utilisée pour l'aspersion, lors des cérémonies du Vendredi saint et l'Epitaphios. Utilisé seulement dans le rite grec.
in scheme: T69