icône de la Résurrection
created: 2012-05-16T00:00:00+02:00
modified: 2014-01-10T00:00:00+01:00
status: 1
type: Concept
alternative label: anasthasis
broader: T69-2103
definition: Icône représentant la Résurrection, exposée de Pâques à l'Ascension ainsi que tous les dimanches et posée sur les cercueils lors des cérémonies funèbres.
in scheme: T69