nécessaire orthodoxe pour la communion des malades
created: 2012-05-16T00:00:00+02:00
modified: 2014-01-10T00:00:00+01:00
status: 1
type: Concept
broader: T69-2103
definition: Coffret porté au cou, contenant une boîte pour la sainte réserve, un calice, une cuiller, deux flacons : un pour l'eau, l'autre pour le vin. Il s'agit en fait d'un petit tabernacle ou petit artophorion.
in scheme: T69