patène orthodoxe
terme associe: T69-1269
created: 2012-05-16T00:00:00+02:00
modified: 2014-01-10T00:00:00+01:00
status: 1
type: Concept
alternative label: diskos
alternative label: disque
broader: T69-2103
definition: Petit plat circulaire dont l'intérieur au moins est toujours doré, destiné à mettre le pain qui doit être consacré. Dans le culte orthodoxe russe, la patène avec marli et sans rebord, est montée sur un pied central. Dans le rite grec, le disque sans pied comporte un haut rebord vertical. La patène est recouverte comme le calice par les voiles.
in scheme: T69
related: T69-1269