conopée
terme associe: T69-673
created: 2012-05-16T00:00:00+02:00
modified: 2014-12-02T16:22:04+01:00
status: 1
type: Concept
alternative label: pavillon de tabernacle
broader: T69-2213
definition: Voile recouvrant le tabernacle, de la couleur du temps liturgique.
in scheme: T69
preferred label: tabernacle veils @en-us
preferred label: conopeo di tabernacolo @it
preferred label: conopeu @pt
related: T69-673