pale
terme associe: T69-1195
terme associe: T69-1269
terme associe: T69-2252
created: 2012-05-16T00:00:00+02:00
modified: 2014-12-02T16:49:00+01:00
status: 1
type: Concept
alternative label: palle
broad match: cb11936841q
broader: T69-2213
definition: Linge consacré, de forme carrée, qui sert à couvrir le calice et la patène utilisés pendant la messe. La pale est renforcée à l'intérieur par un carton. Le dessous doit être en tissu blanc, de lin ou de chanvre. Le dessus, plus richement décoré, est marqué d’un symbole christique.
in scheme: T69
preferred label: palls (chalice covers) @en-us
preferred label: palla @it
preferred label: pala @pt
related: T69-1195
related: T69-1269
related: T69-2252