voile d'ostensoir
terme associe: T69-1261
created: 2012-05-16T00:00:00+02:00
modified: 2014-12-02T16:59:05+01:00
status: 1
type: Concept
alternative label: couvre-ostensoir
alternative label: voile de l'ostensoir
broad match: http://data.bnf.fr/ark:/12148/cb120635808
broader: T69-2213
definition: Pièce de soie blanche carrée ou housse losangique placée sur l’ostensoir, avant son utilisation.
in scheme: T69
preferred label: monstrance veils @en-us
preferred label: copriostensorio @it
preferred label: véu de ostensório @pt
related: T69-1261