voile de calice
terme associe: T69-1195
terme associe: T69-1269
terme associe: T69-2240
created: 2012-05-16T00:00:00+02:00
modified: 2014-12-02T17:04:05+01:00
status: 1
type: Concept
alternative label: voile du calice
broad match: http://data.bnf.fr/ark:/12148/cb11979303b
broader: T69-2213
definition: Etoffe carrée suffisamment ample pour recouvrir entièrement un calice surmonté d'un purificatoire, d'une patène et d'une pale. Normalement en soie, il peut faire partie d'un ornement et y être assorti.
in scheme: T69
preferred label: chalice veils @en-us
preferred label: velo di calice @it
preferred label: véu de calice @pt
related: T69-1195
related: T69-1269
related: T69-2240