bourse pour l'ampoule à huile des malades
terme associe: T69-1298
terme associe: T69-2217
created: 2012-05-16T00:00:00+02:00
modified: 2014-12-03T10:55:04+01:00
status: 1
type: Concept
broad match: http://data.bnf.fr/ark:/12148/cb167275867
broader: T69-2255
definition: Bourse de soie violette, utilisée pour porter une ampoule à huile des malades, lorsqu'un prêtre doit donner le sacrement de l'extrême-onction. Le cordon dont elle est pourvue permet de la porter autour du cou.
in scheme: T69
preferred label: bags for the ampulla for oil of the sick @en-us
preferred label: borsa del vasetto per l'olio degli infirmi @it
preferred label: bolsa para ampola do Oleo dos Enfermos @pt
related: T69-1298
related: T69-2217