chrémeau
created: 2012-05-16T00:00:00+02:00
modified: 2014-12-03T10:55:57+01:00
status: 1
type: Concept
alternative label: bandeau d'ordination de prêtre
alternative label: bandeau de sacre d'évêque
alternative label: chrémeau d'ordination
alternative label: chrémeau de sacre d'évêque
broad match: http://data.bnf.fr/ark:/12148/cb119669330
broader: T69-2255
definition: Bande ou bandelette de linge blanc que l'on place sur la tête ou les mains après qu'elles ont reçu l'onction d'une des saintes huiles.
in scheme: T69
narrower: T69-2262
narrower: T69-2266
preferred label: chrismales (clothing) @en-us
preferred label: crismale @it
preferred label: crismal @pt
scope note: Ne pas confondre avec le chrémeau d'autel.