chrémeau de baptême
created: 2012-05-16T00:00:00+02:00
modified: 2014-12-03T10:57:02+01:00
status: 1
type: Concept
alternative label: bandeau de baptême
alternative label: bonnet de baptême
broad match: http://vocab.getty.edu/aat/300391104
broader: T69-2258
definition: Linge blanc que l'on pose sur la tête du nouveau baptisé après l'onction du saint Chrême. Il est souvent remplacé par un bonnet de baptême.
in scheme: T69
preferred label: baptismal chrism cloths @en-us
preferred label: crismale del battesimo @it
preferred label: crismal do baptismo @pt