chrémeau de confirmation
terme associe: T69-6842
created: 2012-05-16T00:00:00+02:00
modified: 2014-12-03T10:58:05+01:00
status: 1
type: Concept
alternative label: bandeau de confirmation
alternative label: brassard de communion
alternative label: brassard de confirmation
broad match: cb11945759g
broader: T69-2258
definition: Bandelette de lin, souvent ornée d'une croix, que le nouveau confirmé devait porter sur le front après l'onction du saint Chrême. Conservé par le nouveau confirmé, il est souvent remplacé par un brassard.
in scheme: T69
preferred label: confirmation chrism cloths @en-us
preferred label: crismale della confermazione @it
preferred label: crismal da confirmação @pt
related: T69-6842