parement des fonts baptismaux
terme associe: T69-693
created: 2012-05-16T00:00:00+02:00
modified: 2014-12-03T11:00:45+01:00
status: 1
type: Concept
alternative label: tour des fonts baptismaux
broad match: cb11978488k
broad match: http://vocab.getty.edu/aat/300080617
broader: T69-2255
definition: Tissu que l'on suspend autour de la cuve ou sur le couvercle des fonts baptismaux pour l'orner.
in scheme: T69
preferred label: baptismal font facing @en-us
preferred label: guarnizione del fonte battesimale @it
preferred label: pano da pia baptismal @pt
related: T69-693