arc
created: 2012-05-16T00:00:00+02:00
modified: 2015-01-28T17:09:19+01:00
status: 1
type: Concept
broader: T69-230
definition: Organe appareillé porté par deux points d'appui et présentant un intrados.
in scheme: T69
preferred label: arches @en-us
scope note: Voir aussi le Thesaurus de la désignation des œuvres architecturales et des espaces aménagés.