voile du temps de la Passion
created: 2012-05-16T00:00:00+02:00
modified: 2014-12-03T11:17:19+01:00
status: 1
type: Concept
alternative label: voile de carême
alternative label: voile de la croix de procession
alternative label: voile des statues et des croix
broader: T69-2295
definition: Voile habituellement violet recouvrant, pendant le temps de la Passion, les croix, les statues et les tableaux d'une église. Il peut être rouge pour les croix de procession et noir pour la croix du Vendredi saint.
in scheme: T69
preferred label: Lenten cloths @en-us
preferred label: velo del tempo della Passione @it
preferred label: pano do tempo da Paixão @pt