fausse-voûte
created: 2012-05-16T00:00:00+02:00
modified: 2015-01-07T12:11:10+01:00
status: 1
type: Concept
alternative label: fausse-coupole
alternative label: fausse-voûte en berceau
alternative label: fausse-voûte en coupole
alternative label: fausse-voûte en cul-de-four
alternative label: fausse-voûte à cantons
alternative label: fausse-voûte à quartiers
broader: T69-230
definition: Couvrement non maçonné qui peut adopter toutes les formes de la voûte.
in scheme: T69