linge ou garniture liés aux rites funéraires
created: 2012-05-16T00:00:00+02:00
modified: 2014-12-03T10:41:50+01:00
status: 1
type: Concept
broader: T69-2168
definition: Pièce textile de couleur violette ou noire le plus souvent, utilisée exclusivement au moment des cérémonies funéraires. Elle peut présenter des motifs funéraires.
in scheme: T69
narrower: T69-2347
narrower: T69-2350
narrower: T69-2354
narrower: T69-2359
narrower: T69-2364
narrower: T69-2367
narrower: T69-2372
narrower: T69-9480
preferred label: linen and ornaments for funeral rites @en-us
preferred label: lini e coperture per i riti funerari @it
preferred label: guarnições relacionadas com os ritos funerários @pt