draperie de brancard de procession
terme associe: T69-950
created: 2012-05-16T00:00:00+02:00
modified: 2014-12-03T10:30:45+01:00
status: 1
type: Concept
alternative label: draperie de brancard
alternative label: garniture de brancard de procession
broad match: http://vocab.getty.edu/aat/300298963
broader: T69-2375
definition: Étoffe souvent en drap d'or ou d'argent qui recouvre un brancard de procession
in scheme: T69
preferred label: processional stretcher falls @en-us
preferred label: drappo per la base processionale @it
preferred label: cobertura de andor @pt
related: T69-950