écharpe de croix de confrérie
terme associe: T69-1572
created: 2012-05-16T00:00:00+02:00
modified: 2014-12-03T10:34:00+01:00
status: 1
type: Concept
broad match: http://vocab.getty.edu/aat/300263685
broader: T69-2375
definition: Bande de tissu placée sur une croix de confrérie et portant généralement l’emblème de cette confrérie. Elle est souvent retenue par une armature fixée aux trois branches supérieures de la croix, les extrémités de l'écharpe retombant de part et d'autre du crucifix, de manière à former une sorte de dais. Elle peut aussi être portée sans armature par les bras de la croix qu'elle enveloppe. Plus rarement, elle est suspendue sous le nœud de la croix.
in scheme: T69
preferred label: confraternity cross veils @en-us
preferred label: fusciacco @it
preferred label: faixa de cruz de confraria @pt
related: T69-1572