linge lié à la dévotion
created: 2012-05-16T00:00:00+02:00
modified: 2014-12-02T15:47:38+01:00
status: 1
type: Concept
alternative label: linge du baiser de paix
alternative label: sachet d'accouchée
alternative label: scapulaire
alternative label: voile de baiser de paix
broader: T69-2168
definition: Pièce textile destinée à couvrir, protéger, envelopper, etc., un objet de dévotion.
in scheme: T69
preferred label: linen related to devotion @en-us
preferred label: lini e coperture per la devozione @it
preferred label: guarnições relacionadas com a devoção @pt