bas et chaussures liturgiques
terme associe: T69-6507
created: 2012-05-16T00:00:00+02:00
modified: 2014-12-03T12:45:49+01:00
status: 1
type: Concept
broader: T69-2451
definition: Élément d’habillement des jambes et des pieds dont le caractère précieux est variable suivant le rang et la fonction du clerc qui le porte ou le temps liturgique.
in scheme: T69
narrower: T69-2453
narrower: T69-2455
narrower: T69-2456
preferred label: liturgical gaiters and shoes @en-us
preferred label: calze e calzature liturgiche @it
preferred label: meias e sapatos litúrgicos @pt
related: T69-6507