sandales liturgiques
created: 2012-05-16T00:00:00+02:00
modified: 2014-12-03T12:48:37+01:00
status: 1
type: Concept
alternative label: escarpins liturgiques
alternative label: mules du pape
alternative label: mules liturgiques
alternative label: sandales pontificales
alternative label: sandales épiscopales
broader: T69-2452
definition: Chaussures fermées, à talon plat, portées lors des messes pontificales par les prélats. Elles sont en soie, de la couleur du temps liturgique (sauf le noir), et sont portées avec des bas liturgiques.
in scheme: T69
preferred label: liturgical sandals @en-us
preferred label: sandali pontificali @it
preferred label: sandálias pontificais @pt