amict
created: 2012-05-16T00:00:00+02:00
modified: 2014-12-03T13:10:35+01:00
status: 1
type: Concept
alternative label: amict paré
broad match: cb11941484w
broader: T69-2462
definition: Tissu blanc, de lin ou de chanvre, rectangulaire, porté sous une aube, un surplis ou un rochet, servant à protéger le col de ces vêtements et à préserver du froid le cou. L'amict est porté sur la nuque, retourné autour du col du vêtement mis par-dessous (généralement une soutane). Il présente à chaque angle d’un des longs côtés, un long cordon habituellement blanc ou de couleur suivant la qualité du prélat qui le porte (rouge pour un cardinal, vert pour un évêque résident, violet pour un évêque de passage et pour tous en temps de deuil et de pénitence).
in scheme: T69
preferred label: amices @en-us
preferred label: amitto @it
preferred label: amito @pt