aube
terme associe: T69-2471
created: 2012-05-16T00:00:00+02:00
modified: 2014-12-03T13:14:47+01:00
status: 1
type: Concept
alternative label: aube parée
broad match: cb11941484w
broader: T69-2462
definition: Long vêtement blanc pouvant comporter des broderies ou des dentelles en forme de tunique descendant jusqu'aux pieds. Elle peut être serrée à la taille par un cordon ou une ceinture.
in scheme: T69
preferred label: albs @en-us
preferred label: camices @it
preferred label: alva @pt
related: T69-2471