dalmaticelle
terme associe: T69-2492
created: 2012-05-16T00:00:00+02:00
modified: 2014-12-03T13:16:14+01:00
status: 1
type: Concept
broad match: cb11941484w
broad match: http://vocab.getty.edu/aat/300210450
broader: T69-2462
definition: Vêtement de forme semblable à celle d'une dalmatique, que les dignitaires ecclésiastiques portent sous une chasuble ou une chape, sur une aube et une tunicelle, lors des messes solennelles. La dalmaticelle est en soie, sans doublure, généralement pourvue de manches courtes, souvent attachée sous les bras et sur les épaules par des cordons ou des rubans.
in scheme: T69
preferred label: dalmaticellas @en-us
preferred label: dalmaticella @it
preferred label: dalmaticela @pt
related: T69-2492