linteau
created: 2012-05-16T00:00:00+02:00
modified: 2015-01-07T12:32:05+01:00
status: 1
type: Concept
broader: T69-230
definition: Bloc de pierre (à la différence de la plate-bande qui est appareillée), pièce de bois ou de métal rectiligne, couvrant une baie. Il reçoit la charge des parties situées au-dessus de la baie et la reporte sur les deux points d'appui.
in scheme: T69
preferred label: lintels @en-us
scope note: Voir aussi le Thesaurus de la désignation des œuvres architecturales et des espaces aménagés.