rochet
terme associe: T69-2466
terme associe: T69-2515
created: 2012-05-16T00:00:00+02:00
modified: 2014-12-03T14:27:11+01:00
status: 1
type: Concept
broad match: cb11941484w
broader: T69-2462
definition: Vêtement blanc ne descendant habituellement que jusqu'au-dessus des genoux et munie de manches ajustées aux poignets. Le rochet est porté dans le chœur par les clercs sous une chape, une dalmatique, une mozette ou un mantelet. Pour diverses autres fonctions liturgiques, il est porté sous un surplis ou une cotta. Il est souvent orné de dentelles ou de tulle à la différence du surplis qui en est dépourvu. Plus court que l'aube, le rochet a des manches plus étroites que celles du surplis.
in scheme: T69
preferred label: rochets @en-us
preferred label: rocchetto @it
preferred label: roquete @pt
related: T69-2466
related: T69-2515