tunicelle
terme associe: T69-2492
created: 2012-05-16T00:00:00+02:00
modified: 2014-12-03T14:29:44+01:00
status: 1
type: Concept
broad match: cb11941484w
broad match: http://vocab.getty.edu/aat/300210450
broader: T69-2462
definition: Vêtement en soie que les dignitaires ecclésiastiques portent sur une aube et sous une dalmaticelle lors des messes solennelles. La tunicelle est sans doublure, à manches plus longues et plus étroites que celles d'une dalmaticelle.
in scheme: T69
preferred label: tunicellas @en-us
preferred label: tunicella @it
preferred label: tunicela @pt
related: T69-2492