vêtement liturgique de dessus
created: 2012-05-16T00:00:00+02:00
modified: 2014-12-03T14:30:36+01:00
status: 1
type: Concept
alternative label: falda
alternative label: fanon papal
alternative label: manteau de chœur
alternative label: mantelet
alternative label: mantellone
alternative label: orfroi
broader: T69-2451
definition: Élément d’habillement porté au-dessus des autres vêtements. Sa forme, son décor, sa couleur, la nature même de l’étoffe ou du tissu, varient selon le rang et la fonction du clerc qui le revêt, et le temps liturgique. Ce type de vêtement comprend généralement des orfrois, bandes de broderies ou de tissu brodé appliqué, souvent en remploi. Il peut également présenter des marques d’appartenance. Lorsque plusieurs de ces éléments forment un ensemble, on parle d’ornement liturgique.
in scheme: T69
narrower: T69-2480
narrower: T69-2488
narrower: T69-2492
narrower: T69-2504
narrower: T69-2513
narrower: T69-2515
preferred label: outer liturgical vestments @en-us
preferred label: sopravvesti liturgiche @it
preferred label: vestes litúrgicas exteriores @pt