dalmatique
terme associe: T69-2469
terme associe: T69-2477
terme associe: T69-2511
terme associe: T69-2627
created: 2012-05-16T00:00:00+02:00
modified: 2014-12-03T14:38:26+01:00
status: 1
type: Concept
alternative label: clavi
broader: T69-2479
definition: Vêtement en forme de tunique courte, qui s'enfile par la tête, porté par-dessus tous les autres par les diacres. La tunique, vêtement porté par les sous-diacres, ne se différencie que par le fait qu’elle est plus courte et moins ornée. Généralement ouverte sur les côtés, la dalmatique est ornée sur le devant et le dos de galons verticaux ou de bandes de tissu, appelées clavi. La dalmatique peut avoir un col assorti, amovible : le collet de dalmatique.
in scheme: T69
preferred label: dalmatics @en-us
preferred label: dalmatica @it
preferred label: dalmática @pt
related: T69-2469
related: T69-2477
related: T69-2511
related: T69-2627