mozette
terme associe: T69-6837
created: 2012-05-16T00:00:00+02:00
modified: 2014-12-03T14:40:08+01:00
status: 1
type: Concept
alternative label: camail
alternative label: pelisse de chœur
alternative label: pèlerine d'église
broad match: http://vocab.getty.edu/aat/300210450
broader: T69-2479
definition: Pèlerine courte, ouverte ou boutonnée sur le devant, comportant un petit capuchon, portée, dans le chœur, sur une soutane et éventuellement un surplis ou un rochet par les nombreux clercs pour lesquels elle est un signe de juridiction. Le capuchon est cousu ou amovible et maintenu par des boutons ou des agrafes. Certains clercs, prêtres ou enfants de chœur, qui n'ont pas le droit de revêtir la mozette, peuvent porter un vêtement de même forme, le camail.
in scheme: T69
preferred label: mozzettas @en-us
preferred label: mozzetta @it
preferred label: mozeta @pt
related: T69-6837