plate-bande
created: 2012-05-16T00:00:00+02:00
modified: 2015-02-25T12:31:58+01:00
status: 1
type: Concept
broader: T69-230
definition: Organe rectiligne, appareillé (à la différence du linteau) porté par deux points d'appui.
in scheme: T69
preferred label: platbands @en-us
scope note: Voir aussi le Thesaurus de la désignation des œuvres architecturales et des espaces aménagés.