coiffure liturgique
terme associe: T69-6527
created: 2012-05-16T00:00:00+02:00
modified: 2014-12-03T12:49:26+01:00
status: 1
type: Concept
broad match: Costume ecclésiastique
broader: T69-2451
definition: Élément d’habillement, plus ou moins précieux, servant à couvrir ou orner la tête du clerc.
in scheme: T69
narrower: T69-2519
narrower: T69-2522
narrower: T69-2527
narrower: T69-2530
narrower: T69-2536
preferred label: liturgical headdresses @en-us
preferred label: copricapi liturgici @it
preferred label: coberturas litúrgicas para a cabeça @pt
related: T69-6527