étole de clerc
terme associe: T69-2488
terme associe: T69-2511
terme associe: T69-2552
terme associe: T69-2573
terme associe: T69-9230
created: 2012-05-16T00:00:00+02:00
modified: 2014-12-03T11:41:17+01:00
status: 1
type: Concept
alternative label: stolon
alternative label: étole de viatique
alternative label: étole diaconale
alternative label: étole large
alternative label: étole pastorale
broad match: cb11941484w
broader: T69-2539
definition: Longue bande d'étoffe, généralement doublée, portée autour du cou par toute la hiérarchie ecclésiastique, lors des cérémonies. L'étole porte une croix au milieu de sa longueur et souvent une autre près de ses extrémités, plus larges, généralement terminées par des franges. L’étole est généralement assortie à la chasuble. L'étole pastorale possède au tiers supérieur de sa hauteur une patte d'étoffe, un ruban ou un cordon généralement terminé par des glands ou des pompons, réunissant ses deux moitiés. L'étole diaconale, attachée à ses extrémités, est portée en sautoir sur l'épaule gauche et sous le bras droit, comporte parfois deux rubans ou un cordon à environ 50 cm des extrémités, pour mieux la maintenir en place. L'étole large, ou stolon, est portée par le diacre pour les messes des temps de pénitence ou de deuil en alternance avec une chasuble pliée ; elle est en soie violette, sans frange ni croix, de largeur constante, environ 25 cm. L'étole de viatique est de dimensions plus de couleur blanche sur une face et violette sur l'autre.
in scheme: T69
preferred label: stoles (vestments) @en-us
preferred label: stola @it
preferred label: estola @pt
related: T69-2488
related: T69-2511
related: T69-2552
related: T69-2573
related: T69-9230