manipule
terme associe: T69-2488
terme associe: T69-2511
terme associe: T69-2562
created: 2012-05-16T00:00:00+02:00
modified: 2014-12-03T11:45:18+01:00
status: 1
type: Concept
broad match: cb11941484w
broader: T69-2539
definition: Bande d'étoffe portée par tous les clercs sur l’avant-bras gauche, exclusivement lors des messes. Le manipule est assorti à la chasuble et à l’étole dont il reprend les caractéristiques (motif de croix en son centre et aux extrémités évasées). Il est généralement terminé par des franges et mesure, plié, environ 50 cm de long.
in scheme: T69
preferred label: maniples @en-us
preferred label: manipolo @it
preferred label: manípulo @pt
related: T69-2488
related: T69-2511
related: T69-2562