collet de confrérie
terme associe: T69-2576
created: 2012-05-16T00:00:00+02:00
modified: 2014-12-03T12:32:05+01:00
status: 1
type: Concept
broader: T69-2591
definition: Col blanc amovible à rabat, que portent certains membres d'une confrérie de charité sur une soutanelle ou une dalmatique.
in scheme: T69
preferred label: confraternity collars @en-us
preferred label: colletto di veste di confraternita @it
preferred label: cabeção de confraria @pt
related: T69-2576