élément de couvrement
created: 2012-05-16T00:00:00+02:00
modified: 2014-09-08T11:21:30+02:00
status: 1
type: Concept
broad match: http://vocab.getty.edu/aat/300078053
broader: T69-230
definition: Partie de l’appareil d’une plate-bande, d’une voûte, d’un arc ou d’une charpente.
in scheme: T69
narrower: T69-264
narrower: T69-276