costume de pénitent
created: 2012-05-16T00:00:00+02:00
modified: 2014-12-03T12:38:00+01:00
status: 1
type: Concept
alternative label: cagoule de pénitent
alternative label: sac de pénitent
broader: T69-2591
definition: Costume des confréries de pénitents, composé d'une sorte d'aube appelée sac de pénitent fermée à la taille par un cordon et d'une cagoule couvrant entièrement le visage.
in scheme: T69
preferred label: penitent's costumes @en-us
preferred label: costume di penitente @it
preferred label: hábito de penitente @pt