costume de suisse
created: 2012-05-16T00:00:00+02:00
modified: 2014-12-03T12:40:37+01:00
status: 1
type: Concept
alternative label: bas de suisse
alternative label: baudrier de suisse
alternative label: bicorne de suisse
alternative label: canne de suisse
alternative label: capote de suisse
alternative label: chapeau de suisse
alternative label: culotte de suisse
alternative label: gilet de suisse
alternative label: hallebarde de suisse
alternative label: nœud d'épaule de suisse
alternative label: souliers de suisse
alternative label: épaulette de suisse
alternative label: épée de suisse
broad match: Catégorie:Costume religieux
broader: T69-2591
definition: Tenue réservée au suisse, employé laïc chargé de faire régner l'ordre dans l’église. La "petite tenue" comprend des souliers et un pantalon ordinaires, une capote ou une redingote avec éventuellement un nœud d'épaule, une épaulette, un bicorne simple ou chapeau de suisse, un baudrier auquel est suspendue une épée, une hallebarde et une canne à pommeau. La "grande tenue" comporte en plus des souliers à boucles, des bas, une culotte à la française, un gilet, un habit agrémenté d'une épaulette et d'un nœud d'épaule, d'un bicorne de cérémonie, etc.
in scheme: T69
preferred label: Swiss guard uniforms @en-us
preferred label: costume dell svizzero @it
preferred label: uniforme de guarda-suiço @pt