banc
created: 2012-05-16T00:00:00+02:00
modified: 2014-12-05T12:09:55+01:00
status: 1
type: Concept
broader: T69-2666
definition: Siège à plusieurs places, non garni, c'est-à-dire à fond en bois. Il comporte ou non un dossier, des accotoirs et des éléments annexes.
in scheme: T69
preferred label: benches (furniture) @en-us