banquette
created: 2012-05-16T00:00:00+02:00
modified: 2014-12-05T12:11:48+01:00
status: 1
type: Concept
alternative label: banquette à accotoirs
alternative label: banquette à dossier
broad match: http://data.bnf.fr/ark:/12148/cb131627639
broader: T69-2666
definition: Siège à plusieurs places, peu profond, garni, pouvant comporter soit un dossier, soit des accotoirs, soit les deux.
in scheme: T69
preferred label: banquettes (benches) @en-us