meuble annexe des sièges
created: 2012-05-16T00:00:00+02:00
modified: 2014-10-10T15:47:29+02:00
status: 1
type: Concept
broad match: http://data.bnf.fr/ark:/12148/cb131627639
broad match: Siège (meuble)
broad match: http://vocab.getty.edu/aat/300037769
broader: T69-2636
definition: Meuble d'accompagnement pour les sièges pouvant ou non leur être assortis.
in scheme: T69
narrower: T69-2685
narrower: T69-2687